{"text_format":"1","workbook":"xlsx","n_sheets":7,"sheets":["Home","ARRS Summary","ARR Staff","PCN NonARRS","All Funding Streams","IIF","Data"],"not_rendered":{"charts":0,"images":0,"macros":1,"external_links":0,"defined_names":5,"comments":0,"pivot_tables":0},"unopened":[],"bounds":{"document_bytes":16777216,"sheet_cells":100000,"rows_first":2000,"rows_last":500,"rows_between":2000,"halvings":0,"cell_chars":16384,"cell_head_chars":4096},"cells_cut":0,"cells_raw":0,"read":"whole","date_system":"1900"}

{"sheet":"Home","index":0,"n_rows":25,"n_cols":16,"rows_kept":25,"cut":false,"hidden":false,"merged":[[0,15,0,17],[5,1,5,17],[13,1,13,17],[2,13,2,14],[3,13,3,14],[3,15,3,16],[2,15,2,16],[2,3,2,5],[3,3,3,5],[2,8,3,8]]}
[null,{"$f":"D4&\" PCN Funding Stream Calculator and ARRS Tracker 23/24\"","v":" PCN Funding Stream Calculator and ARRS Tracker 23/24"},null,null,null,null,null,null,null,null,null,null,null,null,null,"Developed by Steve Rudd: stephen.rudd@nhs.net"]
[]
[null,null,null,"Dropdown",null,null,null,null,"List Sizes 23/24","Weighted","Actual","Adj'd",null,"Last Updated by PCN:",null,"2023-04-18T11:29:07"]
[null,"Select your PCN:",null,null,null,null,null,null,null,{"$f":"IF(D4=\"\",\"\",VLOOKUP(D4,PCNs[#All],2,FALSE))","v":""},{"$f":"IF(D4=\"\",\"\",VLOOKUP(D4,PCNs[#All],3,FALSE))","v":""},{"$f":"IF(D4=\"\",\"\",VLOOKUP(D4,PCNs[#All],5,FALSE))","v":""},null,"ARR salaries entered up to:",null,{"$f":"'ARRS Summary'!H2","v":"Not Yet Entered"}]
[]
[null,"Workforce"]
{"$rows_left_out":20}
{"sheet":"ARRS Summary","index":1,"n_rows":32,"n_cols":17,"rows_kept":32,"cut":false,"hidden":true,"merged":[[21,1,21,3],[21,6,21,7],[27,6,27,7],[27,1,27,3],[29,8,29,13],[26,1,26,3],[26,6,26,7],[28,1,28,3],[28,6,28,7],[22,1,22,3],[22,6,22,7],[24,1,24,3],[24,6,24,7],[25,1,25,3],[25,6,25,7],[23,1,23,3],[30,6,30,7],[31,1,31,3],[31,6,31,7],[29,1,29,3],[29,6,29,7],[18,1,18,3],[18,6,18,7],[19,1,19,3],[19,6,19,7],[20,1,20,3],[15,1,15,3],[15,6,15,7],[16,1,16,3],[16,6,16,7],[17,1,17,3],[17,6,17,7],[14,1,14,3],[14,6,14,7],[3,14,4,15],[3,16,4,16],[3,17,5,17],[10,6,10,7],[12,1,12,3],[12,6,12,7],[13,1,13,3],[13,6,13,7],[3,1,3,2],[10,1,10,3],[1,2,1,3],[2,8,2,16],[3,3,4,3],[3,4,4,4],[3,5,4,5],[3,8,4,8],[3,9,4,9],[3,13,4,13],[23,6,23,7],[0,9,0,16],[3,18,5,18],[5,14,5,15],[9,8,9,13],[20,6,20,7]]}
[null,{"$f":"Home!D4&\" ARR Workforce Position and Forecast 23/24\"","v":" ARR Workforce Position and Forecast 23/24"},null,null,null,null,null,null,null,"Developed by Steve Rudd: stephen.rudd@nhs.net"]
[null,null,"Last Updated:",null,"2023-04-18T11:29:07",null,"ARR salaries entered up to:",{"$f":"_xlfn.IFS(I2=12,\"Mar 24\",I2=11,\"Feb 24\",I2=10,\"Jan 24\",I2=9,\"Dec 23\",I2=8,\"Nov 23\",I2=7,\"Oct 23\",I2=6,\"Sept 23\",I2=5,\"Aug 23\",I2=4,\"Jul 23\",I2=3,\"Jun 23\",I2=2,\"May 23\",I2=1,\"Apr 23\",I2=0,\"Not Yet Entered\")","v":"Not Yet Entered"},{"$f":"_xlfn.IFS('ARR Staff'!BY1<>\"\",12,'ARR Staff'!BT1<>\"\",11,'ARR Staff'!BO1<>\"\",10,'ARR Staff'!BJ1<>\"\",9,'ARR Staff'!BE1<>\"\",8,'ARR Staff'!AZ1<>\"\",7,'ARR Staff'!AU1<>\"\",6,'ARR Staff'!AP1<>\"\",5,'ARR Staff'!AK1<>\"\",4,'ARR Staff'!AF1<>\"\",3,'ARR Staff'!AA1<>\"\",2,'ARR Staff'!V1<>\"\",1,'ARR Staff'!V1=\"\",0)","v":0}]
[null,null,null,null,null,null,null,null,"Further 23/24 Analysis"]
[null,"Population",null,"Annual ARR budget","Forecast Spend (based on avg claim)","PCN Forecast Over/Underspend",null,null,{"$f":"\"ARR \nbudget \nYTD \n(\"&_xlfn.IFS(I2=12,\"Mar 24\",I2=11,\"Feb 24\",I2=10,\"Jan 24\",I2=9,\"Dec 23\",I2=8,\"Nov 23\",I2=7,\"Oct 23\",I2=6,\"Sept 23\",I2=5,\"Aug 23\",I2=4,\"Jul 23\",I2=3,\"Jun 23\",I2=2,\"May 23\",I2=1,\"Apr 23\",I2=0,\"N/A\")&\")\"","v":"ARR \nbudget \nYTD \n(N/A)"},{"$f":"\"Spend YTD  (\" & _xlfn.IFS(I2=12,\"Mar 24\",I2=11,\"Feb 24\",I2=10,\"Jan 24\",I2=9,\"Dec 23\",I2=8,\"Nov 23\",I2=7,\"Oct 23\",I2=6,\"Sept 23\",I2=5,\"Aug 23\",I2=4,\"Jul 23\",I2=3,\"Jun 23\",I2=2,\"May 23\",I2=1,\"Apr 23\",I2=0,\"N/A\")&\")\"","v":"Spend YTD  (N/A)"},null,null,null,"Y/E Forecast (latest month)",{"$f":"\"ARR Residual Cost to Practices/PCN YTD (\" & _xlfn.IFS(I2=12,\"Mar 24\",I2=11,\"Feb 24\",I2=10,\"Jan 24\",I2=9,\"Dec 23\",I2=8,\"Nov 23\",I2=7,\"Oct 23\",I2=6,\"Sept 23\",I2=5,\"Aug 23\",I2=4,\"Jul 23\",I2=3,\"Jun 23\",I2=2,\"May 23\",I2=1,\"Apr 23\",I2=0,\"N/A\")&\")\"","v":"ARR Residual Cost to Practices/PCN YTD (N/A)"},null,"Y/E Forecast residual cost"]
[null,"Year","Weighted"]
[null,"2023/24",{"$f":"Home!$J$4","v":""},{"$f":"IF(C6=\"\",\"\",C6*22.671)","v":""},{"$f":"IF(C6=\"\",\"\",IF('ARR Staff'!V1=\"\",SUM(F13:F30),SUM(SUM('ARR Staff'!V1,'ARR Staff'!AA1,'ARR Staff'!AF1,'ARR Staff'!AK1,'ARR Staff'!AP1,'ARR Staff'!AU1,'ARR Staff'!AZ1,'ARR Staff'!BE1,'ARR Staff'!BJ1,'ARR Staff'!BO1,'ARR Staff'!BT1,'ARR Staff'!BY1))/I2*12)+M32)","v":""},{"$f":"IF(C6=\"\",\"\",E6-D6)","v":""},null,null,{"$f":"IF(C6=\"\",\"\",D6/12*I2)","v":""},{"$f":"SUM('ARR Staff'!V1,'ARR Staff'!AA1,'ARR Staff'!AF1,'ARR Staff'!AK1,'ARR Staff'!AP1,'ARR Staff'!AU1,'ARR Staff'!AZ1,'ARR Staff'!BE1,'ARR Staff'!BJ1,'ARR Staff'!BO1,'ARR Staff'!BT1,'ARR Staff'!BY1)","v":0},null,null,null,{"$f":"IF(I2=0,E6,SUM(J6,M32,_xlfn.IFS('ARR Staff'!BY1<>\"\",0,'ARR Staff'!BT1<>\"\",'ARR Staff'!BT1,'ARR Staff'!BO1<>\"\",'ARR Staff'!BO1*2,'ARR Staff'!BJ1<>\"\",'ARR Staff'!BJ1*3,'ARR Staff'!BE1<>\"\",'ARR Staff'!BE1*4,'ARR Staff'!AZ1<>\"\",'ARR Staff'!AZ1*5,'ARR Staff'!AU1<>\"\",'ARR Staff'!AU1*6,'ARR Staff'!AP1<>\"\",'ARR Staff'!AP1*7,'ARR Staff'!AK1<>\"\",'ARR Staff'!AK1*8,'ARR Staff'!AF1<>\"\",'ARR Staff'!AF1*9,'ARR Staff'!AA1<>\"\",'ARR Staff'!AA1*10,'ARR Staff'!V1<>\"\",'ARR Staff'!V1*11)))","v":""},{"$f":"'ARR Staff'!CC1+'ARR Staff'!CB1","v":0},null,{"$f":"IF(I2=0,\"N/A\",O6/I2*12)","v":"N/A"}]
{"$rows_left_out":27}
{"sheet":"ARR Staff","index":2,"n_rows":105,"n_cols":82,"rows_kept":105,"cut":false,"hidden":true,"merged":[[0,1,1,1],[0,4,0,5],[1,77,2,80],[2,37,2,41],[2,42,2,46],[2,47,2,51],[2,52,2,56],[1,8,2,8],[1,9,2,9],[1,13,2,13],[1,15,2,15],[1,16,2,16],[2,17,2,21],[2,22,2,26],[2,27,2,31],[2,32,2,36],[2,1,2,7],[2,67,2,71],[2,72,2,76],[2,57,2,61],[2,62,2,66]]}
[null,"ARR Staff",null,null,"* = mandatory fields",null,null,null,null,null,null,null,null,null,null,null,"TOTALS",{"$f":"IF(SUM(R4:R1000)=0,0,SUM(R4:R1000))","v":0},{"$f":"IF(SUM(S4:S1000)=0,0,SUM(S4:S1000))","v":0},0,0,{"$f":"IF(R1=0,\"\",IF(SUM(V4:V1000)=0,0,SUM(V4:V1000)))","v":""},{"$f":"IF(SUM(W4:W1000)=0,0,SUM(W4:W1000))","v":0},{"$f":"IF(SUM(X4:X1000)=0,0,SUM(X4:X1000))","v":0},0,0,{"$f":"IF(W1=0,\"\",IF(SUM(AA4:AA1000)=0,0,SUM(AA4:AA1000)))","v":""},{"$f":"IF(SUM(AB4:AB1000)=0,0,SUM(AB4:AB1000))","v":0},{"$f":"IF(SUM(AC4:AC1000)=0,0,SUM(AC4:AC1000))","v":0},0,0,{"$f":"IF(AB1=0,\"\",IF(SUM(AF4:AF1000)=0,0,SUM(AF4:AF1000)))","v":""},{"$f":"IF(SUM(AG4:AG1000)=0,0,SUM(AG4:AG1000))","v":0},{"$f":"IF(SUM(AH4:AH1000)=0,0,SUM(AH4:AH1000))","v":0},0,0,{"$f":"IF(AG1=0,\"\",IF(SUM(AK4:AK1000)=0,0,SUM(AK4:AK1000)))","v":""},{"$f":"IF(SUM(AL4:AL1000)=0,0,SUM(AL4:AL1000))","v":0},{"$f":"IF(SUM(AM4:AM1000)=0,0,SUM(AM4:AM1000))","v":0},0,0,{"$f":"IF(AL1=0,\"\",IF(SUM(AP4:AP1000)=0,0,SUM(AP4:AP1000)))","v":""},{"$f":"IF(SUM(AQ4:AQ1000)=0,0,SUM(AQ4:AQ1000))","v":0},{"$f":"IF(SUM(AR4:AR1000)=0,0,SUM(AR4:AR1000))","v":0},0,0,{"$f":"IF(AQ1=0,\"\",IF(SUM(AU4:AU1000)=0,0,SUM(AU4:AU1000)))","v":""},{"$f":"IF(SUM(AV4:AV1000)=0,0,SUM(AV4:AV1000))","v":0},{"$f":"IF(SUM(AW4:AW1000)=0,0,SUM(AW4:AW1000))","v":0},0,0,{"$f":"IF(AV1=0,\"\",IF(SUM(AZ4:AZ1000)=0,0,SUM(AZ4:AZ1000)))","v":""},{"$f":"IF(SUM(BA4:BA1000)=0,0,SUM(BA4:BA1000))","v":0},{"$f":"IF(SUM(BB4:BB1000)=0,0,SUM(BB4:BB1000))","v":0},0,0,{"$f":"IF(BA1=0,\"\",IF(SUM(BE4:BE1000)=0,0,SUM(BE4:BE1000)))","v":""},{"$f":"IF(SUM(BF4:BF1000)=0,0,SUM(BF4:BF1000))","v":0},{"$f":"IF(SUM(BG4:BG1000)=0,0,SUM(BG4:BG1000))","v":0},0,0,{"$f":"IF(BF1=0,\"\",IF(SUM(BJ4:BJ1000)=0,0,SUM(BJ4:BJ1000)))","v":""},{"$f":"IF(SUM(BK4:BK1000)=0,0,SUM(BK4:BK1000))","v":0},{"$f":"IF(SUM(BL4:BL1000)=0,0,SUM(BL4:BL1000))","v":0},0,0,{"$f":"IF(BK1=0,\"\",IF(SUM(BO4:BO1000)=0,0,SUM(BO4:BO1000)))","v":""},{"$f":"IF(SUM(BP4:BP1000)=0,0,SUM(BP4:BP1000))","v":0},{"$f":"IF(SUM(BQ4:BQ1000)=0,0,SUM(BQ4:BQ1000))","v":0},0,0,{"$f":"IF(BP1=0,\"\",IF(SUM(BT4:BT1000)=0,0,SUM(BT4:BT1000)))","v":""},{"$f":"IF(SUM(BU4:BU1000)=0,0,SUM(BU4:BU1000))","v":0},{"$f":"IF(SUM(BV4:BV1000)=0,0,SUM(BV4:BV1000))","v":0},0,0,{"$f":"IF(BU1=0,\"\",IF(SUM(BY4:BY1000)=0,0,SUM(BY4:BY1000)))","v":""},{"$f":"IF(SUM(BZ4:BZ1000)=0,0,SUM(BZ4:BZ1000))","v":0},{"$f":"IF(SUM(CA4:CA1000)=0,0,SUM(CA4:CA1000))","v":0},0,0]
[null,null,null,null,null,null,null,null,"Dropdown","Conditional dropdown",null,null,null,"Calculated",null,"Enter when employee left","Calculated","Enter","Calculated","Enter","Calculated","Enter","Enter","Calculated","Enter","Calculated","Enter","Enter","Calculated","Enter","Calculated","Enter","Enter","Calculated","Enter","Calculated","Enter","Enter","Calculated","Enter","Calculated","Enter","Enter","Enter","Enter","Calculated","Enter","Enter","Calculated","Enter","Calculated","Enter","Enter","Calculated","Enter","Calculated","Enter","Enter","Calculated","Enter","Calculated","Enter","Enter","Calculated","Enter","Calculated","Enter","Enter","Calculated","Enter","Calculated","Enter","Enter","Calculated","Enter","Calculated","Enter","Calculated Totals"]
[null,"Optional Fields",null,null,null,null,null,null,null,null,null,null,null,null,null,null,null,"April",null,null,null,null,"May",null,null,null,null,"June",null,null,null,null,"July",null,null,null,null,"August",null,null,null,null,"September",null,null,null,null,"October",null,null,null,null,"November",null,null,null,null,"December",null,null,null,null,"January",null,null,null,null,"February",null,null,null,null,"March"]
[null,"Name","ARR Portal Code Ref*","Appraisal Date 23/24","Line Manager","Clinical Supervisor & Support","Employer","Works At","Role*","MH ARR A4C Band*","Non MH salary","MH salary","Current hours/week*","Current WTE","PCN Start Date*","PCN End Date*","Monthly Max Reimbursable 23/24 (Latest)","Actual Salary (+SPLW fee)*","Above ARR Claim","Other (non-reimbursable)","Indicative Portal Value","Actual Portal Reimbursement*","Actual Salary (+SPLW fee)*","Above ARR Claim","Other (non-reimbursable)","Indicative Portal Value","Actual Portal Reimbursement*","Actual Salary (+SPLW fee)*","Above ARR Claim","Other (non-reimbursable)","Indicative Portal Value","Actual Portal Reimbursement*","Actual Salary (+SPLW fee)*","Above ARR Claim","Other (non-reimbursable)","Indicative Portal Value","Actual Portal Reimbursement*","Actual Salary (+SPLW fee)*","Above ARR Claim","Other (non-reimbursable)","Indicative Portal Value","Actual Portal Reimbursement*","Actual Salary (+SPLW fee)","Above ARR Claim","Other (non-reimbursable)","Indicative Portal Value","Actual Portal Reimbursement*","Actual Salary (+SPLW fee)*","Above ARR Claim","Other (non-reimbursable)","Indicative Portal Value","Actual Portal Reimbursement*","Actual Salary (+SPLW fee)*","Above ARR Claim","Other (non-reimbursable)","Indicative Portal Value","Actual Portal Reimbursement*","Actual Salary (+SPLW fee)*","Above ARR Claim","Other (non-reimbursable)","Indicative Portal Value","Actual Portal Reimbursement*","Actual Salary (+SPLW fee)*","Above ARR Claim","Other (non-reimbursable)","Indicative Portal Value","Actual Portal Reimbursement*","Actual Salary (+SPLW fee)*","Above ARR Claim","Other (non-reimbursable)","Indicative Portal Value","Actual Portal Reimbursement*","Actual Salary (+SPLW fee)*","Above ARR Claim","Other (non-reimbursable)","Indicative Portal Value","Actual Portal Reimbursement*","ARRS income YTD TOTAL","Above ARR TOTAL","Non-reimbursable TOTAL","Residual cost to PCN","Comments"]
[null,null,null,null,null,null,null,null,null,{"$f":"IF(I5=\"\",\"\",IF(I5='ARRS Summary'!$B$30,\"Enter A4C band here\",\"No Entry Required\"))","v":""},{"$f":"VLOOKUP(I5,Data!F$4:H$21,3,FALSE)","v":{"$error":"#N/A"}},{"$f":"IF(I5<>'ARRS Summary'!B$30,\"\",_xlfn.IFS(J5=Data!$B$4,Data!$H$11,J5=Data!$B$5,Data!$H$5,J5=Data!$B$6,Data!$H$21,J5=Data!$B$7,Data!$H$6,J5=Data!$B$8,Data!$H$19))","v":""},null,{"$f":"IF(M5=\"\",\"\",M5/37.5)","v":""},null,null,{"$f":"IF(I5=\"\",\"\",IF(I5='ARRS Summary'!B$30,L5/2,K5)/12*N5)","v":""},null,{"$f":"IF(R5=\"\",\"\",IF(R5<V5,0,R5-V5))","v":""},null,{"$f":"IF(R5=\"\",\"\",MIN(R5,$Q5))","v":""},{"$f":"IF(R5=\"\",\"\",\"Please enter to match portal\")","v":""},null,{"$f":"IF(W5=\"\",\"\",IF(W5<AA5,0,W5-AA5))","v":""},null,{"$f":"IF(W5=\"\",\"\",MIN(W5,$Q5))","v":""},{"$f":"IF(W5=\"\",\"\",\"Please enter to match portal\")","v":""},null,{"$f":"IF(AB5=\"\",\"\",IF(AB5<AF5,0,AB5-AF5))","v":""},null,{"$f":"IF(AB5=\"\",\"\",MIN(AB5,$Q5))","v":""},{"$f":"IF(AB5=\"\",\"\",\"Please enter to match portal\")","v":""},null,{"$f":"IF(AG5=\"\",\"\",IF(AG5<AK5,0,AG5-AK5))","v":""},null,{"$f":"IF(AG5=\"\",\"\",MIN(AG5,$Q5))","v":""},{"$f":"IF(AG5=\"\",\"\",\"Please enter to match portal\")","v":""},null,{"$f":"IF(AL5=\"\",\"\",IF(AL5<AP5,0,AL5-AP5))","v":""},null,{"$f":"IF(AL5=\"\",\"\",MIN(AL5,$Q5))","v":""},{"$f":"IF(AL5=\"\",\"\",\"Please enter to match portal\")","v":""},null,{"$f":"IF(AQ5=\"\",\"\",IF(AQ5<AU5,0,AQ5-AU5))","v":""},null,{"$f":"IF(AQ5=\"\",\"\",MIN(AQ5,$Q5))","v":""},{"$f":"IF(AQ5=\"\",\"\",\"Please enter to match portal\")","v":""},null,{"$f":"IF(AV5=\"\",\"\",IF(AV5<AZ5,0,AV5-AZ5))","v":""},null,{"$f":"IF(AV5=\"\",\"\",MIN(AV5,$Q5))","v":""},{"$f":"IF(AV5=\"\",\"\",\"Please enter to match portal\")","v":""},null,{"$f":"IF(BA5=\"\",\"\",IF(BA5<BE5,0,BA5-BE5))","v":""},null,{"$f":"IF(BA5=\"\",\"\",MIN(BA5,$Q5))","v":""},{"$f":"IF(BA5=\"\",\"\",\"Please enter to match portal\")","v":""},null,{"$f":"IF(BF5=\"\",\"\",IF(BF5<BJ5,0,BF5-BJ5))","v":""},null,{"$f":"IF(BF5=\"\",\"\",MIN(BF5,$Q5))","v":""},{"$f":"IF(BF5=\"\",\"\",\"Please enter to match portal\")","v":""},null,{"$f":"IF(BK5=\"\",\"\",IF(BK5<BO5,0,BK5-BO5))","v":""},null,{"$f":"IF(BK5=\"\",\"\",MIN(BK5,$Q5))","v":""},{"$f":"IF(BK5=\"\",\"\",\"Please enter to match portal\")","v":""},null,{"$f":"IF(BP5=\"\",\"\",IF(BP5<BT5,0,BP5-BT5))","v":""},null,{"$f":"IF(BP5=\"\",\"\",MIN(BP5,$Q5))","v":""},{"$f":"IF(BP5=\"\",\"\",\"Please enter to match portal\")","v":""},null,{"$f":"IF(BU5=\"\",\"\",IF(BU5<BY5,0,BU5-BY5))","v":""},null,{"$f":"IF(BU5=\"\",\"\",MIN(BU5,$Q5))","v":""},{"$f":"IF(BU5=\"\",\"\",\"Please enter to match portal\")","v":""},{"$f":"IF(I5=\"\",\"\",SUM(V5,AA5,AF5,AK5,AP5,AU5,AZ5,BE5,BJ5,BO5,BT5,BY5))","v":""},{"$f":"IF(I5=\"\",\"\",SUM(S5,X5,AC5,AH5,AM5,AR5,AW5,BB5,BG5,BL5,BQ5,BV5))","v":""},{"$f":"IF(I5=\"\",\"\",SUM(T5,Y5,AD5,AI5,AN5,AS5,AX5,BC5,BH5,BM5,BR5,BW5))","v":""},{"$f":"IF(I5=\"\",\"\",SUM(CA5,CB5))","v":""}]
[null,null,null,null,null,null,null,null,null,{"$f":"IF(I6=\"\",\"\",IF(I6='ARRS Summary'!$B$30,\"Enter A4C band here\",\"No Entry Required\"))","v":""},{"$f":"VLOOKUP(I6,Data!F$4:H$21,3,FALSE)","v":{"$error":"#N/A"}},{"$f":"IF(I6<>'ARRS Summary'!B$30,\"\",_xlfn.IFS(J6=Data!$B$4,Data!$H$11,J6=Data!$B$5,Data!$H$5,J6=Data!$B$6,Data!$H$21,J6=Data!$B$7,Data!$H$6,J6=Data!$B$8,Data!$H$19))","v":""},null,{"$f":"IF(M6=\"\",\"\",M6/37.5)","v":""},null,null,{"$f":"IF(I6=\"\",\"\",IF(I6='ARRS Summary'!B$30,L6/2,K6)/12*N6)","v":""},null,{"$f":"IF(R6=\"\",\"\",IF(R6<V6,0,R6-V6))","v":""},null,{"$f":"IF(R6=\"\",\"\",MIN(R6,$Q6))","v":""},"",null,{"$f":"IF(W6=\"\",\"\",IF(W6<AA6,0,W6-AA6))","v":""},null,{"$f":"IF(W6=\"\",\"\",MIN(W6,$Q6))","v":""},"",null,{"$f":"IF(AB6=\"\",\"\",IF(AB6<AF6,0,AB6-AF6))","v":""},null,{"$f":"IF(AB6=\"\",\"\",MIN(AB6,$Q6))","v":""},{"$f":"IF(AB6=\"\",\"\",\"Please enter to match portal\")","v":""},null,{"$f":"IF(AG6=\"\",\"\",IF(AG6<AK6,0,AG6-AK6))","v":""},null,{"$f":"IF(AG6=\"\",\"\",MIN(AG6,$Q6))","v":""},{"$f":"IF(AG6=\"\",\"\",\"Please enter to match portal\")","v":""},null,{"$f":"IF(AL6=\"\",\"\",IF(AL6<AP6,0,AL6-AP6))","v":""},null,{"$f":"IF(AL6=\"\",\"\",MIN(AL6,$Q6))","v":""},{"$f":"IF(AL6=\"\",\"\",\"Please enter to match portal\")","v":""},null,{"$f":"IF(AQ6=\"\",\"\",IF(AQ6<AU6,0,AQ6-AU6))","v":""},null,{"$f":"IF(AQ6=\"\",\"\",MIN(AQ6,$Q6))","v":""},{"$f":"IF(AQ6=\"\",\"\",\"Please enter to match portal\")","v":""},null,{"$f":"IF(AV6=\"\",\"\",IF(AV6<AZ6,0,AV6-AZ6))","v":""},null,{"$f":"IF(AV6=\"\",\"\",MIN(AV6,$Q6))","v":""},{"$f":"IF(AV6=\"\",\"\",\"Please enter to match portal\")","v":""},null,{"$f":"IF(BA6=\"\",\"\",IF(BA6<BE6,0,BA6-BE6))","v":""},null,{"$f":"IF(BA6=\"\",\"\",MIN(BA6,$Q6))","v":""},{"$f":"IF(BA6=\"\",\"\",\"Please enter to match portal\")","v":""},null,{"$f":"IF(BF6=\"\",\"\",IF(BF6<BJ6,0,BF6-BJ6))","v":""},null,{"$f":"IF(BF6=\"\",\"\",MIN(BF6,$Q6))","v":""},{"$f":"IF(BF6=\"\",\"\",\"Please enter to match portal\")","v":""},null,{"$f":"IF(BK6=\"\",\"\",IF(BK6<BO6,0,BK6-BO6))","v":""},null,{"$f":"IF(BK6=\"\",\"\",MIN(BK6,$Q6))","v":""},{"$f":"IF(BK6=\"\",\"\",\"Please enter to match portal\")","v":""},null,{"$f":"IF(BP6=\"\",\"\",IF(BP6<BT6,0,BP6-BT6))","v":""},null,{"$f":"IF(BP6=\"\",\"\",MIN(BP6,$Q6))","v":""},{"$f":"IF(BP6=\"\",\"\",\"Please enter to match portal\")","v":""},null,{"$f":"IF(BU6=\"\",\"\",IF(BU6<BY6,0,BU6-BY6))","v":""},null,{"$f":"IF(BU6=\"\",\"\",MIN(BU6,$Q6))","v":""},{"$f":"IF(BU6=\"\",\"\",\"Please enter to match portal\")","v":""},{"$f":"IF(I6=\"\",\"\",SUM(V6,AA6,AF6,AK6,AP6,AU6,AZ6,BE6,BJ6,BO6,BT6,BY6))","v":""},{"$f":"IF(I6=\"\",\"\",SUM(S6,X6,AC6,AH6,AM6,AR6,AW6,BB6,BG6,BL6,BQ6,BV6))","v":""},{"$f":"IF(I6=\"\",\"\",SUM(T6,Y6,AD6,AI6,AN6,AS6,AX6,BC6,BH6,BM6,BR6,BW6))","v":""},{"$f":"IF(I6=\"\",\"\",SUM(CA6,CB6))","v":""}]
{"$rows_left_out":100}
{"sheet":"PCN NonARRS","index":3,"n_rows":106,"n_cols":50,"rows_kept":106,"cut":false,"hidden":true,"merged":[[2,37,2,39],[2,40,2,42],[2,43,2,45],[2,46,2,48],[2,49,3,49],[0,1,0,5],[2,19,2,21],[2,22,2,24],[2,25,2,27],[2,28,2,30],[2,31,2,33],[2,34,2,36],[1,6,2,6],[1,10,2,10],[1,12,2,12],[2,13,2,15],[2,16,2,18]]}
[null,"Non-ARR Staff (optional)",null,null,null,null,null,null,null,null,null,null,"TOTALS",{"$f":"SUM(N4:N106)","v":0},{"$f":"SUM(O4:O106)","v":0},0,0,0,0,0,0,0,0,0,0,0,0,0,0,0,0,0,0,0,0,0,0,0,0,0,0,0,0,0,0,0,0,0,0]
[null,null,null,null,null,null,null,null,null,null,"Calculated",null,"Enter when left",null,null,"Calculated",null,null,"Calculated",null,null,"Calculated",null,null,"Calculated",null,null,"Calculated",null,null,"Calculated",null,null,"Calculated",null,null,"Calculated",null,null,"Calculated",null,null,"Calculated",null,null,"Calculated",null,null,"Calculated"]
[null,null,null,null,null,null,null,null,null,null,null,null,null,"April",null,null,"May",null,null,"June",null,null,"July",null,null,"August",null,null,"September",null,null,"October",null,null,"November",null,null,"December",null,null,"January",null,null,"February",null,null,"March",null,null,"Annual Total"]
[null,"Name","Employer","Role","Appraisal Date 23/24","Line Manager / Supervisor","Funding Stream","Non MH salary","MH salary","Hours/week","WTE","PCN Start Date","PCN End Date","Total Salary Costs","Other Costs","Total Month","Total Salary Costs","Other Costs","Total Month","Total Salary Costs","Other Costs","Total Month","Total Salary Costs","Other Costs","Total Month","Total Salary Costs","Other Costs","Total Month","Total Salary Costs","Other Costs","Total Month","Total Salary Costs","Other Costs","Total Month","Total Salary Costs","Other Costs","Total Month","Total Salary Costs","Other Costs","Total Month","Total Salary Costs","Other Costs","Total Month","Total Salary Costs","Other Costs","Total Month","Total Salary Costs","Other Costs","Total Month"]
[null,null,null,null,null,null,null,null,null,null,{"$f":"IF(J5=\"\",\"\",J5/37.5)","v":""},null,null,null,null,{"$f":"IF(N5=\"\",\"\",SUM(N5:O5))","v":""},null,null,{"$f":"IF(Q5=\"\",\"\",SUM(Q5:R5))","v":""},null,null,{"$f":"IF(T5=\"\",\"\",SUM(T5:U5))","v":""},null,null,{"$f":"IF(W5=\"\",\"\",SUM(W5:X5))","v":""},null,null,{"$f":"IF(Z5=\"\",\"\",SUM(Z5:AA5))","v":""},null,null,{"$f":"IF(AC5=\"\",\"\",SUM(AC5:AD5))","v":""},null,null,{"$f":"IF(AF5=\"\",\"\",SUM(AF5:AG5))","v":""},null,null,{"$f":"IF(AI5=\"\",\"\",SUM(AI5:AJ5))","v":""},null,null,{"$f":"IF(AL5=\"\",\"\",SUM(AL5:AM5))","v":""},null,null,{"$f":"IF(AO5=\"\",\"\",SUM(AO5:AP5))","v":""},null,null,{"$f":"IF(AR5=\"\",\"\",SUM(AR5:AS5))","v":""},null,null,{"$f":"IF(AU5=\"\",\"\",SUM(AU5:AV5))","v":""},{"$f":"IF(AW5=\"\",\"\",SUM(AW5,AT5,AQ5,AN5,AK5,AH5,AE5,AB5,Y5,V5,S5,P5))","v":""}]
[null,null,null,null,null,null,null,null,null,null,"",null,null,null,null,"",null,null,"",null,null,"",null,null,"",null,null,"",null,null,"",null,null,"",null,null,"",null,null,"",null,null,"",null,null,"",null,null,"",{"$f":"IF(AW6=\"\",\"\",SUM(AW6,AT6,AQ6,AN6,AK6,AH6,AE6,AB6,Y6,V6,S6,P6))","v":""}]
{"$rows_left_out":101}
{"sheet":"All Funding Streams","index":4,"n_rows":21,"n_cols":9,"rows_kept":21,"cut":false,"hidden":true,"merged":[[6,4,6,5],[6,8,6,10],[0,10,0,17],[3,4,3,5],[4,4,4,5],[5,4,5,5],[3,8,3,10],[4,8,4,10],[5,8,5,10],[0,1,1,7],[11,4,11,5],[7,4,7,5],[7,8,7,10],[20,1,23,7],[16,4,16,5],[17,4,17,5],[18,4,18,5],[8,8,8,10],[9,4,9,5],[9,8,9,10],[12,4,12,5],[13,1,13,7],[14,4,14,5],[14,8,14,10],[12,8,12,10],[10,4,10,5]]}
[null,{"$f":"\"Known National PCN Funding Streams - Indicative Values (2023/24) for \"&Home!D4","v":"Known National PCN Funding Streams - Indicative Values (2023/24) for "}]
[]
[]
[null,"Funding Stream","Basis","Paid to","Calculated as",null,"PCN Total","Monthly","Notes"]
[null,"Core PCN Funding","Actual","PCN","£1.50 per reg'd pt",null,{"$f":"IF(Home!D4=\"\",\"\",1.5*Home!K4)","v":""},{"$f":"IF(G5=\"\",\"\",G5/12)","v":""},"Use of funding at PCN discretion"]
[null,"Clinical Director Funding","Actual","PCN","£0.729 per reg'd pt",null,{"$f":"IF(G5=\"\",\"\",(0.729*Home!K4))","v":""},{"$f":"IF(G6=\"\",\"\",G6/12)","v":""},"Use of funding at PCN discretion"]
{"$rows_left_out":16}
{"sheet":"IIF","index":5,"n_rows":7,"n_cols":9,"rows_kept":7,"cut":false,"hidden":true,"merged":[[1,9,1,10]]}
[null,{"$f":"IF(Home!D4=\"\",\"IIF Indicator Summary 23/24\",\"IIF Indicator - summary for 23/24 for \"&Home!D4 & \"\n(NOTE: Remember that actual income also dependent upon prevalence)\" )","v":"IIF Indicator Summary 23/24"},"Lower Threshold","Upper Threshold","Points","Desired Direction","Approx max income/ indicator","Target PCN aiming for","Approx. income for chosen target"]
[null,"ACC-08: % of appointments where time from booking to appointment was two weeks or less",0.85,0.9,71,"Up",{"$f":"IF(Home!$D$4=\"\",E2*198,E2*198/49000*Home!$K$4)","v":14058},0.9,{"$f":"IF(H2>=D2,G2,IF(H2<=C2,0,ROUND((E2/SUM(D2-C2)),0)*(H2-C2)*(G2/E2)))","v":14058}]
[null,"CAN-02: % of lower GI 2-wk wait (fast track) cancer referrals accompanied by a FIT result, with the result recorded either in the 21 days leading up to the referral",0.65,0.8,22,"Up",{"$f":"IF(Home!$D$4=\"\",E3*198,E3*198/49000*Home!$K$4)","v":4356},0.8,{"$f":"IF(IF(H3>=D3,G3,IF(H3<=C3,0,ROUND((E3/SUM(D3-C3)),0)*(H3-C3)*(G3/E3)))>G3,G3,IF(H3>=D3,G3,IF(H3<=C3,0,ROUND((E3/SUM(D3-C3)),0)*(H3-C3)*(G3/E3))))","v":4356}]
[null,"HI-03: % of QOF reg'd LD patients >=14y with annual LD H/Check and completed Health Action Plan in addition to recording of ethnicity",0.6,0.8,36,"Up",{"$f":"IF(Home!$D$4=\"\",E4*198,E4*198/49000*Home!$K$4)","v":7128},0.8,7128]
[null,"VI-02: % 18-64y + clinical at-risk received a flu vaccination 01/09/23-31/03/24",0.72,0.9,113,"Up",{"$f":"IF(Home!$D$4=\"\",E5*198,E5*198/49000*Home!$K$4)","v":22374},0.9,22374]
[null,"VI-03: % 2-3y (on 31/08/23) received a flu vaccination 01/09/23-31/03/24",0.64,0.82,20,"Up",{"$f":"IF(Home!$D$4=\"\",E6*198,E6*198/49000*Home!$K$4)","v":3960},0.82,{"$f":"IF(IF(H6>=D6,G6,IF(H6<=C6,0,ROUND((E6/SUM(D6-C6)),0)*(H6-C6)*(G6/E6)))>G6,G6,IF(H6>=D6,G6,IF(H6<=C6,0,ROUND((E6/SUM(D6-C6)),0)*(H6-C6)*(G6/E6))))","v":3960}]
{"$rows_left_out":2}
{"sheet":"Data","index":6,"n_rows":21,"n_cols":14,"rows_kept":21,"cut":false,"hidden":true,"merged":[]}
[]
[]
[null,"MHP Bands Dropdown",null,"Months Dropdown",null,"Role","AfC Band","2023/24",null,"PCN","W. List   (Jan 23)","Actual List Size (Jan 23)","2016 reg'd pop'n","Adj'd pop'n 23/24"]
[null,4,null,"April",null,"Clinical Pharmacist","7-8a",59312,null,"Aspen",30142.25,30560,29694,31488.514007382961]
[null,5,null,"May",null,"Pharmacy Technician",5,38187,null,"Berkeley Vale",49627.85,{"$f":"42304+5284","v":47588},43861,45133.927007634898]
[null,6,null,"June",null,"Paramedic",7,57465,null,"Central",52829.48,57201,52342,54371.843022810601]
{"$rows_left_out":15}